<feed xmlns='http://www.w3.org/2005/Atom'>
<title>linux-toradex.git/security/apparmor/policy_unpack_test.c, branch v6.16-rc6</title>
<subtitle>Linux kernel for Apalis and Colibri modules</subtitle>
<link rel='alternate' type='text/html' href='https://git.toradex.cn/cgit/linux-toradex.git/'/>
<entry>
<title>module: Convert symbol namespace to string literal</title>
<updated>2024-12-02T19:34:44+00:00</updated>
<author>
<name>Peter Zijlstra</name>
<email>peterz@infradead.org</email>
</author>
<published>2024-12-02T14:59:47+00:00</published>
<link rel='alternate' type='text/html' href='https://git.toradex.cn/cgit/linux-toradex.git/commit/?id=cdd30ebb1b9f36159d66f088b61aee264e649d7a'/>
<id>cdd30ebb1b9f36159d66f088b61aee264e649d7a</id>
<content type='text'>
Clean up the existing export namespace code along the same lines of
commit 33def8498fdd ("treewide: Convert macro and uses of __section(foo)
to __section("foo")") and for the same reason, it is not desired for the
namespace argument to be a macro expansion itself.

Scripted using

  git grep -l -e MODULE_IMPORT_NS -e EXPORT_SYMBOL_NS | while read file;
  do
    awk -i inplace '
      /^#define EXPORT_SYMBOL_NS/ {
        gsub(/__stringify\(ns\)/, "ns");
        print;
        next;
      }
      /^#define MODULE_IMPORT_NS/ {
        gsub(/__stringify\(ns\)/, "ns");
        print;
        next;
      }
      /MODULE_IMPORT_NS/ {
        $0 = gensub(/MODULE_IMPORT_NS\(([^)]*)\)/, "MODULE_IMPORT_NS(\"\\1\")", "g");
      }
      /EXPORT_SYMBOL_NS/ {
        if ($0 ~ /(EXPORT_SYMBOL_NS[^(]*)\(([^,]+),/) {
  	if ($0 !~ /(EXPORT_SYMBOL_NS[^(]*)\(([^,]+), ([^)]+)\)/ &amp;&amp;
  	    $0 !~ /(EXPORT_SYMBOL_NS[^(]*)\(\)/ &amp;&amp;
  	    $0 !~ /^my/) {
  	  getline line;
  	  gsub(/[[:space:]]*\\$/, "");
  	  gsub(/[[:space:]]/, "", line);
  	  $0 = $0 " " line;
  	}

  	$0 = gensub(/(EXPORT_SYMBOL_NS[^(]*)\(([^,]+), ([^)]+)\)/,
  		    "\\1(\\2, \"\\3\")", "g");
        }
      }
      { print }' $file;
  done

Requested-by: Masahiro Yamada &lt;masahiroy@kernel.org&gt;
Signed-off-by: Peter Zijlstra (Intel) &lt;peterz@infradead.org&gt;
Link: https://mail.google.com/mail/u/2/#inbox/FMfcgzQXKWgMmjdFwwdsfgxzKpVHWPlc
Acked-by: Greg KH &lt;gregkh@linuxfoundation.org&gt;
Signed-off-by: Linus Torvalds &lt;torvalds@linux-foundation.org&gt;
</content>
<content type='xhtml'>
<div xmlns='http://www.w3.org/1999/xhtml'>
<pre>
Clean up the existing export namespace code along the same lines of
commit 33def8498fdd ("treewide: Convert macro and uses of __section(foo)
to __section("foo")") and for the same reason, it is not desired for the
namespace argument to be a macro expansion itself.

Scripted using

  git grep -l -e MODULE_IMPORT_NS -e EXPORT_SYMBOL_NS | while read file;
  do
    awk -i inplace '
      /^#define EXPORT_SYMBOL_NS/ {
        gsub(/__stringify\(ns\)/, "ns");
        print;
        next;
      }
      /^#define MODULE_IMPORT_NS/ {
        gsub(/__stringify\(ns\)/, "ns");
        print;
        next;
      }
      /MODULE_IMPORT_NS/ {
        $0 = gensub(/MODULE_IMPORT_NS\(([^)]*)\)/, "MODULE_IMPORT_NS(\"\\1\")", "g");
      }
      /EXPORT_SYMBOL_NS/ {
        if ($0 ~ /(EXPORT_SYMBOL_NS[^(]*)\(([^,]+),/) {
  	if ($0 !~ /(EXPORT_SYMBOL_NS[^(]*)\(([^,]+), ([^)]+)\)/ &amp;&amp;
  	    $0 !~ /(EXPORT_SYMBOL_NS[^(]*)\(\)/ &amp;&amp;
  	    $0 !~ /^my/) {
  	  getline line;
  	  gsub(/[[:space:]]*\\$/, "");
  	  gsub(/[[:space:]]/, "", line);
  	  $0 = $0 " " line;
  	}

  	$0 = gensub(/(EXPORT_SYMBOL_NS[^(]*)\(([^,]+), ([^)]+)\)/,
  		    "\\1(\\2, \"\\3\")", "g");
        }
      }
      { print }' $file;
  done

Requested-by: Masahiro Yamada &lt;masahiroy@kernel.org&gt;
Signed-off-by: Peter Zijlstra (Intel) &lt;peterz@infradead.org&gt;
Link: https://mail.google.com/mail/u/2/#inbox/FMfcgzQXKWgMmjdFwwdsfgxzKpVHWPlc
Acked-by: Greg KH &lt;gregkh@linuxfoundation.org&gt;
Signed-off-by: Linus Torvalds &lt;torvalds@linux-foundation.org&gt;
</pre>
</div>
</content>
</entry>
<entry>
<title>apparmor: test: Fix memory leak for aa_unpack_strdup()</title>
<updated>2024-11-27T03:21:05+00:00</updated>
<author>
<name>Jinjie Ruan</name>
<email>ruanjinjie@huawei.com</email>
</author>
<published>2024-10-11T01:22:41+00:00</published>
<link rel='alternate' type='text/html' href='https://git.toradex.cn/cgit/linux-toradex.git/commit/?id=7290f59231910ccba427d441a6e8b8c6f6112448'/>
<id>7290f59231910ccba427d441a6e8b8c6f6112448</id>
<content type='text'>
The string allocated by kmemdup() in aa_unpack_strdup() is not
freed and cause following memory leaks, free them to fix it.

	unreferenced object 0xffffff80c6af8a50 (size 8):
	  comm "kunit_try_catch", pid 225, jiffies 4294894407
	  hex dump (first 8 bytes):
	    74 65 73 74 69 6e 67 00                          testing.
	  backtrace (crc 5eab668b):
	    [&lt;0000000001e3714d&gt;] kmemleak_alloc+0x34/0x40
	    [&lt;000000006e6c7776&gt;] __kmalloc_node_track_caller_noprof+0x300/0x3e0
	    [&lt;000000006870467c&gt;] kmemdup_noprof+0x34/0x60
	    [&lt;000000001176bb03&gt;] aa_unpack_strdup+0xd0/0x18c
	    [&lt;000000008ecde918&gt;] policy_unpack_test_unpack_strdup_with_null_name+0xf8/0x3ec
	    [&lt;0000000032ef8f77&gt;] kunit_try_run_case+0x13c/0x3ac
	    [&lt;00000000f3edea23&gt;] kunit_generic_run_threadfn_adapter+0x80/0xec
	    [&lt;00000000adf936cf&gt;] kthread+0x2e8/0x374
	    [&lt;0000000041bb1628&gt;] ret_from_fork+0x10/0x20
	unreferenced object 0xffffff80c2a29090 (size 8):
	  comm "kunit_try_catch", pid 227, jiffies 4294894409
	  hex dump (first 8 bytes):
	    74 65 73 74 69 6e 67 00                          testing.
	  backtrace (crc 5eab668b):
	    [&lt;0000000001e3714d&gt;] kmemleak_alloc+0x34/0x40
	    [&lt;000000006e6c7776&gt;] __kmalloc_node_track_caller_noprof+0x300/0x3e0
	    [&lt;000000006870467c&gt;] kmemdup_noprof+0x34/0x60
	    [&lt;000000001176bb03&gt;] aa_unpack_strdup+0xd0/0x18c
	    [&lt;0000000046a45c1a&gt;] policy_unpack_test_unpack_strdup_with_name+0xd0/0x3c4
	    [&lt;0000000032ef8f77&gt;] kunit_try_run_case+0x13c/0x3ac
	    [&lt;00000000f3edea23&gt;] kunit_generic_run_threadfn_adapter+0x80/0xec
	    [&lt;00000000adf936cf&gt;] kthread+0x2e8/0x374
	    [&lt;0000000041bb1628&gt;] ret_from_fork+0x10/0x20

Cc: stable@vger.kernel.org
Fixes: 4d944bcd4e73 ("apparmor: add AppArmor KUnit tests for policy unpack")
Signed-off-by: Jinjie Ruan &lt;ruanjinjie@huawei.com&gt;
Signed-off-by: John Johansen &lt;john.johansen@canonical.com&gt;
</content>
<content type='xhtml'>
<div xmlns='http://www.w3.org/1999/xhtml'>
<pre>
The string allocated by kmemdup() in aa_unpack_strdup() is not
freed and cause following memory leaks, free them to fix it.

	unreferenced object 0xffffff80c6af8a50 (size 8):
	  comm "kunit_try_catch", pid 225, jiffies 4294894407
	  hex dump (first 8 bytes):
	    74 65 73 74 69 6e 67 00                          testing.
	  backtrace (crc 5eab668b):
	    [&lt;0000000001e3714d&gt;] kmemleak_alloc+0x34/0x40
	    [&lt;000000006e6c7776&gt;] __kmalloc_node_track_caller_noprof+0x300/0x3e0
	    [&lt;000000006870467c&gt;] kmemdup_noprof+0x34/0x60
	    [&lt;000000001176bb03&gt;] aa_unpack_strdup+0xd0/0x18c
	    [&lt;000000008ecde918&gt;] policy_unpack_test_unpack_strdup_with_null_name+0xf8/0x3ec
	    [&lt;0000000032ef8f77&gt;] kunit_try_run_case+0x13c/0x3ac
	    [&lt;00000000f3edea23&gt;] kunit_generic_run_threadfn_adapter+0x80/0xec
	    [&lt;00000000adf936cf&gt;] kthread+0x2e8/0x374
	    [&lt;0000000041bb1628&gt;] ret_from_fork+0x10/0x20
	unreferenced object 0xffffff80c2a29090 (size 8):
	  comm "kunit_try_catch", pid 227, jiffies 4294894409
	  hex dump (first 8 bytes):
	    74 65 73 74 69 6e 67 00                          testing.
	  backtrace (crc 5eab668b):
	    [&lt;0000000001e3714d&gt;] kmemleak_alloc+0x34/0x40
	    [&lt;000000006e6c7776&gt;] __kmalloc_node_track_caller_noprof+0x300/0x3e0
	    [&lt;000000006870467c&gt;] kmemdup_noprof+0x34/0x60
	    [&lt;000000001176bb03&gt;] aa_unpack_strdup+0xd0/0x18c
	    [&lt;0000000046a45c1a&gt;] policy_unpack_test_unpack_strdup_with_name+0xd0/0x3c4
	    [&lt;0000000032ef8f77&gt;] kunit_try_run_case+0x13c/0x3ac
	    [&lt;00000000f3edea23&gt;] kunit_generic_run_threadfn_adapter+0x80/0xec
	    [&lt;00000000adf936cf&gt;] kthread+0x2e8/0x374
	    [&lt;0000000041bb1628&gt;] ret_from_fork+0x10/0x20

Cc: stable@vger.kernel.org
Fixes: 4d944bcd4e73 ("apparmor: add AppArmor KUnit tests for policy unpack")
Signed-off-by: Jinjie Ruan &lt;ruanjinjie@huawei.com&gt;
Signed-off-by: John Johansen &lt;john.johansen@canonical.com&gt;
</pre>
</div>
</content>
</entry>
<entry>
<title>apparmor: fix policy_unpack_test on big endian systems</title>
<updated>2024-08-25T22:26:30+00:00</updated>
<author>
<name>Guenter Roeck</name>
<email>linux@roeck-us.net</email>
</author>
<published>2024-08-08T15:50:03+00:00</published>
<link rel='alternate' type='text/html' href='https://git.toradex.cn/cgit/linux-toradex.git/commit/?id=98c0cc48e27e9d269a3e4db2acd72b486c88ec77'/>
<id>98c0cc48e27e9d269a3e4db2acd72b486c88ec77</id>
<content type='text'>
policy_unpack_test fails on big endian systems because data byte order
is expected to be little endian but is generated in host byte order.
This results in test failures such as:

 # policy_unpack_test_unpack_array_with_null_name: EXPECTATION FAILED at security/apparmor/policy_unpack_test.c:150
    Expected array_size == (u16)16, but
        array_size == 4096 (0x1000)
        (u16)16 == 16 (0x10)
    # policy_unpack_test_unpack_array_with_null_name: pass:0 fail:1 skip:0 total:1
    not ok 3 policy_unpack_test_unpack_array_with_null_name
    # policy_unpack_test_unpack_array_with_name: EXPECTATION FAILED at security/apparmor/policy_unpack_test.c:164
    Expected array_size == (u16)16, but
        array_size == 4096 (0x1000)
        (u16)16 == 16 (0x10)
    # policy_unpack_test_unpack_array_with_name: pass:0 fail:1 skip:0 total:1

Add the missing endianness conversions when generating test data.

Fixes: 4d944bcd4e73 ("apparmor: add AppArmor KUnit tests for policy unpack")
Cc: Brendan Higgins &lt;brendanhiggins@google.com&gt;
Cc: Kees Cook &lt;keescook@chromium.org&gt;
Signed-off-by: Guenter Roeck &lt;linux@roeck-us.net&gt;
</content>
<content type='xhtml'>
<div xmlns='http://www.w3.org/1999/xhtml'>
<pre>
policy_unpack_test fails on big endian systems because data byte order
is expected to be little endian but is generated in host byte order.
This results in test failures such as:

 # policy_unpack_test_unpack_array_with_null_name: EXPECTATION FAILED at security/apparmor/policy_unpack_test.c:150
    Expected array_size == (u16)16, but
        array_size == 4096 (0x1000)
        (u16)16 == 16 (0x10)
    # policy_unpack_test_unpack_array_with_null_name: pass:0 fail:1 skip:0 total:1
    not ok 3 policy_unpack_test_unpack_array_with_null_name
    # policy_unpack_test_unpack_array_with_name: EXPECTATION FAILED at security/apparmor/policy_unpack_test.c:164
    Expected array_size == (u16)16, but
        array_size == 4096 (0x1000)
        (u16)16 == 16 (0x10)
    # policy_unpack_test_unpack_array_with_name: pass:0 fail:1 skip:0 total:1

Add the missing endianness conversions when generating test data.

Fixes: 4d944bcd4e73 ("apparmor: add AppArmor KUnit tests for policy unpack")
Cc: Brendan Higgins &lt;brendanhiggins@google.com&gt;
Cc: Kees Cook &lt;keescook@chromium.org&gt;
Signed-off-by: Guenter Roeck &lt;linux@roeck-us.net&gt;
</pre>
</div>
</content>
</entry>
<entry>
<title>apparmor: test: add MODULE_DESCRIPTION()</title>
<updated>2024-07-24T17:35:31+00:00</updated>
<author>
<name>Jeff Johnson</name>
<email>quic_jjohnson@quicinc.com</email>
</author>
<published>2024-05-30T01:21:39+00:00</published>
<link rel='alternate' type='text/html' href='https://git.toradex.cn/cgit/linux-toradex.git/commit/?id=4b954a025591a1c7d3a0c0111b6d4730596046b6'/>
<id>4b954a025591a1c7d3a0c0111b6d4730596046b6</id>
<content type='text'>
Fix the 'make W=1' warning:
WARNING: modpost: missing MODULE_DESCRIPTION() in security/apparmor/apparmor_policy_unpack_test.o

Signed-off-by: Jeff Johnson &lt;quic_jjohnson@quicinc.com&gt;
Signed-off-by: John Johansen &lt;john.johansen@canonical.com&gt;
</content>
<content type='xhtml'>
<div xmlns='http://www.w3.org/1999/xhtml'>
<pre>
Fix the 'make W=1' warning:
WARNING: modpost: missing MODULE_DESCRIPTION() in security/apparmor/apparmor_policy_unpack_test.o

Signed-off-by: Jeff Johnson &lt;quic_jjohnson@quicinc.com&gt;
Signed-off-by: John Johansen &lt;john.johansen@canonical.com&gt;
</pre>
</div>
</content>
</entry>
<entry>
<title>apparmor: fix use of strcpy in policy_unpack_test</title>
<updated>2023-07-06T17:58:49+00:00</updated>
<author>
<name>Rae Moar</name>
<email>rmoar@google.com</email>
</author>
<published>2023-01-27T20:12:19+00:00</published>
<link rel='alternate' type='text/html' href='https://git.toradex.cn/cgit/linux-toradex.git/commit/?id=b54aebd4411134b525a82d663a26b2f135ecb7e8'/>
<id>b54aebd4411134b525a82d663a26b2f135ecb7e8</id>
<content type='text'>
Replace the use of strcpy() in build_aa_ext_struct() in
policy_unpack_test.c with strscpy().

strscpy() is the safer method to use to ensure the buffer does not
overflow. This was found by kernel test robot:
https://lore.kernel.org/all/202301040348.NbfVsXO0-lkp@intel.com/.

Reported-by: kernel test robot &lt;lkp@intel.com&gt;

Signed-off-by: Rae Moar &lt;rmoar@google.com&gt;
Signed-off-by: John Johansen &lt;john.johansen@canonical.com&gt;
</content>
<content type='xhtml'>
<div xmlns='http://www.w3.org/1999/xhtml'>
<pre>
Replace the use of strcpy() in build_aa_ext_struct() in
policy_unpack_test.c with strscpy().

strscpy() is the safer method to use to ensure the buffer does not
overflow. This was found by kernel test robot:
https://lore.kernel.org/all/202301040348.NbfVsXO0-lkp@intel.com/.

Reported-by: kernel test robot &lt;lkp@intel.com&gt;

Signed-off-by: Rae Moar &lt;rmoar@google.com&gt;
Signed-off-by: John Johansen &lt;john.johansen@canonical.com&gt;
</pre>
</div>
</content>
</entry>
<entry>
<title>Merge tag 'apparmor-pr-2022-12-14' of git://git.kernel.org/pub/scm/linux/kernel/git/jj/linux-apparmor</title>
<updated>2022-12-14T21:42:09+00:00</updated>
<author>
<name>Linus Torvalds</name>
<email>torvalds@linux-foundation.org</email>
</author>
<published>2022-12-14T21:42:09+00:00</published>
<link rel='alternate' type='text/html' href='https://git.toradex.cn/cgit/linux-toradex.git/commit/?id=93761c93e9da28d8a020777cee2a84133082b477'/>
<id>93761c93e9da28d8a020777cee2a84133082b477</id>
<content type='text'>
Pull apparmor updates from John Johansen:
 "Features:
   - switch to zstd compression for profile raw data

  Cleanups:
   - simplify obtaining the newest label on a cred
   - remove useless static inline functions
   - compute permission conversion on policy unpack
   - refactor code to share common permissins
   - refactor unpack to group policy backwards compatiblity code
   - add __init annotation to aa_{setup/teardown}_dfa_engine()

  Bug Fixes:
   - fix a memleak in
       - multi_transaction_new()
       - free_ruleset()
       - unpack_profile()
       - alloc_ns()
   - fix lockdep warning when removing a namespace
   - fix regression in stacking due to label flags
   - fix loading of child before parent
   - fix kernel-doc comments that differ from fns
   - fix spelling errors in comments
   - store return value of unpack_perms_table() to signed variable"

* tag 'apparmor-pr-2022-12-14' of git://git.kernel.org/pub/scm/linux/kernel/git/jj/linux-apparmor: (64 commits)
  apparmor: Fix uninitialized symbol 'array_size' in policy_unpack_test.c
  apparmor: Add __init annotation to aa_{setup/teardown}_dfa_engine()
  apparmor: Fix memleak in alloc_ns()
  apparmor: Fix memleak issue in unpack_profile()
  apparmor: fix a memleak in free_ruleset()
  apparmor: Fix spelling of function name in comment block
  apparmor: Use pointer to struct aa_label for lbs_cred
  AppArmor: Fix kernel-doc
  LSM: Fix kernel-doc
  AppArmor: Fix kernel-doc
  apparmor: Fix loading of child before parent
  apparmor: refactor code that alloc null profiles
  apparmor: fix obsoleted comments for aa_getprocattr() and audit_resource()
  apparmor: remove useless static inline functions
  apparmor: Fix unpack_profile() warn: passing zero to 'ERR_PTR'
  apparmor: fix uninitialize table variable in error in unpack_trans_table
  apparmor: store return value of unpack_perms_table() to signed variable
  apparmor: Fix kunit test for out of bounds array
  apparmor: Fix decompression of rawdata for read back to userspace
  apparmor: Fix undefined references to zstd_ symbols
  ...
</content>
<content type='xhtml'>
<div xmlns='http://www.w3.org/1999/xhtml'>
<pre>
Pull apparmor updates from John Johansen:
 "Features:
   - switch to zstd compression for profile raw data

  Cleanups:
   - simplify obtaining the newest label on a cred
   - remove useless static inline functions
   - compute permission conversion on policy unpack
   - refactor code to share common permissins
   - refactor unpack to group policy backwards compatiblity code
   - add __init annotation to aa_{setup/teardown}_dfa_engine()

  Bug Fixes:
   - fix a memleak in
       - multi_transaction_new()
       - free_ruleset()
       - unpack_profile()
       - alloc_ns()
   - fix lockdep warning when removing a namespace
   - fix regression in stacking due to label flags
   - fix loading of child before parent
   - fix kernel-doc comments that differ from fns
   - fix spelling errors in comments
   - store return value of unpack_perms_table() to signed variable"

* tag 'apparmor-pr-2022-12-14' of git://git.kernel.org/pub/scm/linux/kernel/git/jj/linux-apparmor: (64 commits)
  apparmor: Fix uninitialized symbol 'array_size' in policy_unpack_test.c
  apparmor: Add __init annotation to aa_{setup/teardown}_dfa_engine()
  apparmor: Fix memleak in alloc_ns()
  apparmor: Fix memleak issue in unpack_profile()
  apparmor: fix a memleak in free_ruleset()
  apparmor: Fix spelling of function name in comment block
  apparmor: Use pointer to struct aa_label for lbs_cred
  AppArmor: Fix kernel-doc
  LSM: Fix kernel-doc
  AppArmor: Fix kernel-doc
  apparmor: Fix loading of child before parent
  apparmor: refactor code that alloc null profiles
  apparmor: fix obsoleted comments for aa_getprocattr() and audit_resource()
  apparmor: remove useless static inline functions
  apparmor: Fix unpack_profile() warn: passing zero to 'ERR_PTR'
  apparmor: fix uninitialize table variable in error in unpack_trans_table
  apparmor: store return value of unpack_perms_table() to signed variable
  apparmor: Fix kunit test for out of bounds array
  apparmor: Fix decompression of rawdata for read back to userspace
  apparmor: Fix undefined references to zstd_ symbols
  ...
</pre>
</div>
</content>
</entry>
<entry>
<title>apparmor: test: make static symbols visible during kunit testing</title>
<updated>2022-12-12T21:13:48+00:00</updated>
<author>
<name>Rae Moar</name>
<email>rmoar@google.com</email>
</author>
<published>2022-12-07T01:40:24+00:00</published>
<link rel='alternate' type='text/html' href='https://git.toradex.cn/cgit/linux-toradex.git/commit/?id=b11e51dd70947107fa4076c6286dce301671afc1'/>
<id>b11e51dd70947107fa4076c6286dce301671afc1</id>
<content type='text'>
Use macros, VISIBLE_IF_KUNIT and EXPORT_SYMBOL_IF_KUNIT, to allow
static symbols to be conditionally set to be visible during
apparmor_policy_unpack_test, which removes the need to include the testing
file in the implementation file.

Change the namespace of the symbols that are now conditionally visible (by
adding the prefix aa_) to avoid confusion with symbols of the same name.

Allow the test to be built as a module and namespace the module name from
policy_unpack_test to apparmor_policy_unpack_test to improve clarity of
the module name.

Provide an example of how static symbols can be dealt with in testing.

Signed-off-by: Rae Moar &lt;rmoar@google.com&gt;
Reviewed-by: David Gow &lt;davidgow@google.com&gt;
Acked-by: John Johansen &lt;john.johansen@canonical.com&gt;
Signed-off-by: Shuah Khan &lt;skhan@linuxfoundation.org&gt;
</content>
<content type='xhtml'>
<div xmlns='http://www.w3.org/1999/xhtml'>
<pre>
Use macros, VISIBLE_IF_KUNIT and EXPORT_SYMBOL_IF_KUNIT, to allow
static symbols to be conditionally set to be visible during
apparmor_policy_unpack_test, which removes the need to include the testing
file in the implementation file.

Change the namespace of the symbols that are now conditionally visible (by
adding the prefix aa_) to avoid confusion with symbols of the same name.

Allow the test to be built as a module and namespace the module name from
policy_unpack_test to apparmor_policy_unpack_test to improve clarity of
the module name.

Provide an example of how static symbols can be dealt with in testing.

Signed-off-by: Rae Moar &lt;rmoar@google.com&gt;
Reviewed-by: David Gow &lt;davidgow@google.com&gt;
Acked-by: John Johansen &lt;john.johansen@canonical.com&gt;
Signed-off-by: Shuah Khan &lt;skhan@linuxfoundation.org&gt;
</pre>
</div>
</content>
</entry>
<entry>
<title>apparmor: Fix uninitialized symbol 'array_size' in policy_unpack_test.c</title>
<updated>2022-11-02T04:23:05+00:00</updated>
<author>
<name>John Johansen</name>
<email>john.johansen@canonical.com</email>
</author>
<published>2022-11-01T12:40:40+00:00</published>
<link rel='alternate' type='text/html' href='https://git.toradex.cn/cgit/linux-toradex.git/commit/?id=4295c60bbe9e63e35d330546eeaa1d2b62dae303'/>
<id>4295c60bbe9e63e35d330546eeaa1d2b62dae303</id>
<content type='text'>
Make sure array_size is initialized in the kunit test to get rid of
compiler warnings. This will also make sure the following tests fail
consistently if the first test fails.

Reported-by: kernel test robot &lt;lkp@intel.com&gt;
Signed-off-by: John Johansen &lt;john.johansen@canonical.com&gt;
</content>
<content type='xhtml'>
<div xmlns='http://www.w3.org/1999/xhtml'>
<pre>
Make sure array_size is initialized in the kunit test to get rid of
compiler warnings. This will also make sure the following tests fail
consistently if the first test fails.

Reported-by: kernel test robot &lt;lkp@intel.com&gt;
Signed-off-by: John Johansen &lt;john.johansen@canonical.com&gt;
</pre>
</div>
</content>
</entry>
<entry>
<title>apparmor: Fix kunit test for out of bounds array</title>
<updated>2022-10-03T21:49:04+00:00</updated>
<author>
<name>John Johansen</name>
<email>john.johansen@canonical.com</email>
</author>
<published>2022-10-03T08:30:38+00:00</published>
<link rel='alternate' type='text/html' href='https://git.toradex.cn/cgit/linux-toradex.git/commit/?id=32490541682bf8ea445e9bd29c866981851e0912'/>
<id>32490541682bf8ea445e9bd29c866981851e0912</id>
<content type='text'>
The apparmor kunit tests are failing on the out of bounds array check
with the following failure

  # policy_unpack_test_unpack_array_out_of_bounds: EXPECTATION FAILED at security/apparmor/policy_unpack_test.c:178
  Expected unpack_array(puf-&gt;e, name, &amp;array_size) == 1, but
  unpack_array(puf-&gt;e, name, &amp;array_size) == -1
  # policy_unpack_test_unpack_array_out_of_bounds: EXPECTATION FAILED at security/apparmor/policy_unpack_test.c:180
  Expected array_size == 0, but
  array_size == 64192
  not ok 5 - policy_unpack_test_unpack_array_out_of_bounds

This is because unpack_array changed to allow distinguishing between
the array not being present and an error. In the error case the array
size is not set and should not be tested.

Reported-by: kernel test robot &lt;yujie.liu@intel.com&gt;
Fixes: 995a5b64620e ("apparmor: make unpack_array return a trianary value")
Signed-off-by: John Johansen &lt;john.johansen@canonical.com&gt;
</content>
<content type='xhtml'>
<div xmlns='http://www.w3.org/1999/xhtml'>
<pre>
The apparmor kunit tests are failing on the out of bounds array check
with the following failure

  # policy_unpack_test_unpack_array_out_of_bounds: EXPECTATION FAILED at security/apparmor/policy_unpack_test.c:178
  Expected unpack_array(puf-&gt;e, name, &amp;array_size) == 1, but
  unpack_array(puf-&gt;e, name, &amp;array_size) == -1
  # policy_unpack_test_unpack_array_out_of_bounds: EXPECTATION FAILED at security/apparmor/policy_unpack_test.c:180
  Expected array_size == 0, but
  array_size == 64192
  not ok 5 - policy_unpack_test_unpack_array_out_of_bounds

This is because unpack_array changed to allow distinguishing between
the array not being present and an error. In the error case the array
size is not set and should not be tested.

Reported-by: kernel test robot &lt;yujie.liu@intel.com&gt;
Fixes: 995a5b64620e ("apparmor: make unpack_array return a trianary value")
Signed-off-by: John Johansen &lt;john.johansen@canonical.com&gt;
</pre>
</div>
</content>
</entry>
<entry>
<title>apparmor: make unpack_array return a trianary value</title>
<updated>2022-10-03T21:49:03+00:00</updated>
<author>
<name>John Johansen</name>
<email>john.johansen@canonical.com</email>
</author>
<published>2022-08-26T16:26:57+00:00</published>
<link rel='alternate' type='text/html' href='https://git.toradex.cn/cgit/linux-toradex.git/commit/?id=371e50a0b19f9765bfb9e4f172e72f4e9a4625bc'/>
<id>371e50a0b19f9765bfb9e4f172e72f4e9a4625bc</id>
<content type='text'>
currently unpack_array() does not return an error nor whether the
array is not present. The ability to detect an error or the array
not being present is needed so rework the unpack_array() to return
the needed information.

Signed-off-by: John Johansen &lt;john.johansen@canonical.com&gt;
</content>
<content type='xhtml'>
<div xmlns='http://www.w3.org/1999/xhtml'>
<pre>
currently unpack_array() does not return an error nor whether the
array is not present. The ability to detect an error or the array
not being present is needed so rework the unpack_array() to return
the needed information.

Signed-off-by: John Johansen &lt;john.johansen@canonical.com&gt;
</pre>
</div>
</content>
</entry>
</feed>
