summaryrefslogtreecommitdiff
path: root/tools/testing/kunit
diff options
context:
space:
mode:
Diffstat (limited to 'tools/testing/kunit')
-rw-r--r--tools/testing/kunit/configs/all_tests.config6
-rw-r--r--tools/testing/kunit/configs/default.config1
-rwxr-xr-xtools/testing/kunit/kunit.py39
-rw-r--r--tools/testing/kunit/kunit_junit.py61
-rw-r--r--tools/testing/kunit/kunit_kernel.py40
-rw-r--r--tools/testing/kunit/kunit_parser.py32
-rwxr-xr-xtools/testing/kunit/kunit_tool_test.py120
-rw-r--r--tools/testing/kunit/qemu_configs/or1k.py18
8 files changed, 285 insertions, 32 deletions
diff --git a/tools/testing/kunit/configs/all_tests.config b/tools/testing/kunit/configs/all_tests.config
index 422e186cf3cf..31e930a0fb69 100644
--- a/tools/testing/kunit/configs/all_tests.config
+++ b/tools/testing/kunit/configs/all_tests.config
@@ -21,6 +21,8 @@ CONFIG_VFAT_FS=y
CONFIG_PCI=y
CONFIG_USB4=y
CONFIG_I2C=y
+CONFIG_SPI=y
+CONFIG_GPIOLIB=y
CONFIG_NET=y
CONFIG_MCTP=y
@@ -44,8 +46,12 @@ CONFIG_REGMAP_BUILD=y
CONFIG_AUDIT=y
+CONFIG_CRYPTO_LIB_ENABLE_ALL_FOR_KUNIT=y
+
CONFIG_PRIME_NUMBERS=y
+CONFIG_CRC_ENABLE_ALL_FOR_KUNIT=y
+
CONFIG_SECURITY=y
CONFIG_SECURITY_APPARMOR=y
CONFIG_SECURITY_LANDLOCK=y
diff --git a/tools/testing/kunit/configs/default.config b/tools/testing/kunit/configs/default.config
index e67af7b9f1bb..2f24147c938c 100644
--- a/tools/testing/kunit/configs/default.config
+++ b/tools/testing/kunit/configs/default.config
@@ -1,3 +1,4 @@
CONFIG_KUNIT=y
CONFIG_KUNIT_EXAMPLE_TEST=y
CONFIG_KUNIT_ALL_TESTS=y
+CONFIG_SPI=y
diff --git a/tools/testing/kunit/kunit.py b/tools/testing/kunit/kunit.py
index 4ec5ecba6d49..91d234ac3b57 100755
--- a/tools/testing/kunit/kunit.py
+++ b/tools/testing/kunit/kunit.py
@@ -21,6 +21,7 @@ from enum import Enum, auto
from typing import Iterable, List, Optional, Sequence, Tuple
import kunit_json
+import kunit_junit
import kunit_kernel
import kunit_parser
from kunit_printer import stdout, null_printer
@@ -49,6 +50,7 @@ class KunitBuildRequest(KunitConfigRequest):
class KunitParseRequest:
raw_output: Optional[str]
json: Optional[str]
+ junit: Optional[str]
summary: bool
failed: bool
@@ -63,6 +65,7 @@ class KunitExecRequest(KunitParseRequest):
run_isolated: Optional[str]
list_tests: bool
list_tests_attr: bool
+ list_suites: bool
@dataclass
class KunitRequest(KunitExecRequest, KunitBuildRequest):
@@ -123,7 +126,7 @@ def _list_tests(linux: kunit_kernel.LinuxSourceTree, request: KunitExecRequest)
lines.pop()
# Filter out any extraneous non-test output that might have gotten mixed in.
- return [l for l in output if re.match(r'^[^\s.]+\.[^\s.]+$', l)]
+ return [l for l in lines if re.match(r'^[^\s.]+\.[^\s.]+$', l)]
def _list_tests_attr(linux: kunit_kernel.LinuxSourceTree, request: KunitExecRequest) -> Iterable[str]:
args = ['kunit.action=list_attr']
@@ -168,6 +171,12 @@ def exec_tests(linux: kunit_kernel.LinuxSourceTree, request: KunitExecRequest) -
for line in attr_output:
print(line.rstrip())
return KunitResult(status=KunitStatus.SUCCESS, elapsed_time=0.0)
+ if request.list_suites:
+ tests = _list_tests(linux, request)
+ output = _suites_from_test_list(tests)
+ for line in output:
+ print(line.rstrip())
+ return KunitResult(status=KunitStatus.SUCCESS, elapsed_time=0.0)
if request.run_isolated:
tests = _list_tests(linux, request)
if request.run_isolated == 'test':
@@ -261,6 +270,13 @@ def parse_tests(request: KunitParseRequest, metadata: kunit_json.Metadata, input
stdout.print_with_timestamp("Test results stored in %s" %
os.path.abspath(request.json))
+ if request.junit:
+ if request.junit == 'stdout':
+ kunit_junit.print_junit_result(test=test)
+ else:
+ kunit_junit.write_junit_result(test=test,filename=request.junit)
+ stdout.print_with_timestamp(f"Test results stored in {os.path.abspath(request.junit)}")
+
if test.status != kunit_parser.TestStatus.SUCCESS:
return KunitResult(KunitStatus.TEST_FAILURE, parse_time), test
@@ -302,6 +318,7 @@ def run_tests(linux: kunit_kernel.LinuxSourceTree,
# So we hackily automatically rewrite --json => --json=stdout
pseudo_bool_flag_defaults = {
'--json': 'stdout',
+ '--junit': 'stdout',
'--raw_output': 'kunit',
}
def massage_argv(argv: Sequence[str]) -> Sequence[str]:
@@ -438,6 +455,9 @@ def add_exec_opts(parser: argparse.ArgumentParser) -> None:
parser.add_argument('--list_tests_attr', help='If set, list all tests and test '
'attributes.',
action='store_true')
+ parser.add_argument('--list_suites', help='If set, list all suites that will be '
+ 'run.',
+ action='store_true')
def add_parse_opts(parser: argparse.ArgumentParser) -> None:
parser.add_argument('--raw_output', help='If set don\'t parse output from kernel. '
@@ -449,6 +469,11 @@ def add_parse_opts(parser: argparse.ArgumentParser) -> None:
help='Prints parsed test results as JSON to stdout or a file if '
'a filename is specified. Does nothing if --raw_output is set.',
type=str, const='stdout', default=None, metavar='FILE')
+ parser.add_argument('--junit',
+ nargs='?',
+ help='Prints parsed test results as JUnit XML to stdout or a file if '
+ 'a filename is specified. Does nothing if --raw_output is set.',
+ type=str, const='stdout', default=None, metavar='FILE')
parser.add_argument('--summary',
help='Prints only the summary line for parsed test results.'
'Does nothing if --raw_output is set.',
@@ -492,6 +517,7 @@ def run_handler(cli_args: argparse.Namespace) -> None:
jobs=cli_args.jobs,
raw_output=cli_args.raw_output,
json=cli_args.json,
+ junit=cli_args.junit,
summary=cli_args.summary,
failed=cli_args.failed,
timeout=cli_args.timeout,
@@ -501,7 +527,8 @@ def run_handler(cli_args: argparse.Namespace) -> None:
kernel_args=cli_args.kernel_args,
run_isolated=cli_args.run_isolated,
list_tests=cli_args.list_tests,
- list_tests_attr=cli_args.list_tests_attr)
+ list_tests_attr=cli_args.list_tests_attr,
+ list_suites=cli_args.list_suites)
result = run_tests(linux, request)
if result.status != KunitStatus.SUCCESS:
sys.exit(1)
@@ -541,6 +568,7 @@ def exec_handler(cli_args: argparse.Namespace) -> None:
exec_request = KunitExecRequest(raw_output=cli_args.raw_output,
build_dir=cli_args.build_dir,
json=cli_args.json,
+ junit=cli_args.junit,
summary=cli_args.summary,
failed=cli_args.failed,
timeout=cli_args.timeout,
@@ -550,7 +578,8 @@ def exec_handler(cli_args: argparse.Namespace) -> None:
kernel_args=cli_args.kernel_args,
run_isolated=cli_args.run_isolated,
list_tests=cli_args.list_tests,
- list_tests_attr=cli_args.list_tests_attr)
+ list_tests_attr=cli_args.list_tests_attr,
+ list_suites=cli_args.list_suites)
result = exec_tests(linux, exec_request)
stdout.print_with_timestamp((
'Elapsed time: %.3fs\n') % (result.elapsed_time))
@@ -568,7 +597,9 @@ def parse_handler(cli_args: argparse.Namespace) -> None:
# We know nothing about how the result was created!
metadata = kunit_json.Metadata()
request = KunitParseRequest(raw_output=cli_args.raw_output,
- json=cli_args.json, summary=cli_args.summary,
+ json=cli_args.json,
+ junit=cli_args.junit,
+ summary=cli_args.summary,
failed=cli_args.failed)
result, _ = parse_tests(request, metadata, kunit_output)
if result.status != KunitStatus.SUCCESS:
diff --git a/tools/testing/kunit/kunit_junit.py b/tools/testing/kunit/kunit_junit.py
new file mode 100644
index 000000000000..3622070358e7
--- /dev/null
+++ b/tools/testing/kunit/kunit_junit.py
@@ -0,0 +1,61 @@
+# SPDX-License-Identifier: GPL-2.0
+#
+# Generates JUnit XML files from KUnit test results
+#
+# Copyright (C) 2026, Google LLC and David Gow.
+
+from xml.sax.saxutils import quoteattr, XMLGenerator
+import xml.etree.ElementTree as ET
+from kunit_parser import Test, TestStatus
+from typing import Optional
+
+# Get a string representing a tes suite (including subtests) in JUnit XML
+def get_test_suite(test: Test, parent: Optional[ET.Element]) -> ET.Element:
+ suite_attrs = {
+ 'name': test.name,
+ 'tests': str(test.counts.total()),
+ 'failures': str(test.counts.failed),
+ 'skipped': str(test.counts.skipped),
+ 'errors': str(test.counts.crashed + test.counts.errors),
+ }
+
+ if parent is not None:
+ test_suite_element = ET.SubElement(parent, 'testsuite', suite_attrs)
+ else:
+ test_suite_element = ET.Element('testsuite', suite_attrs)
+
+ for subtest in test.subtests:
+ if subtest.subtests:
+ get_test_suite(subtest, test_suite_element)
+ continue
+ test_case_element = ET.SubElement(test_suite_element, 'testcase', {'name': subtest.name})
+ if subtest.status == TestStatus.FAILURE:
+ ET.SubElement(test_case_element, 'failure', {}).text = 'Test Failed'
+ elif subtest.status == TestStatus.SKIPPED:
+ ET.SubElement(test_case_element, 'skipped', {}).text = subtest.skip_reason
+ elif subtest.status == TestStatus.TEST_CRASHED:
+ ET.SubElement(test_case_element, 'error', {}).text = 'Test Crashed'
+
+ if subtest.log:
+ ET.SubElement(test_case_element, 'system-out', {}).text = "\n".join(subtest.log)
+
+ return test_suite_element
+
+# Get a string for an entire XML file for the test structure starting at test
+def get_junit_result(test: Test) -> str:
+ root_element = get_test_suite(test, None)
+ ET.indent(root_element)
+ return ET.tostring(root_element, encoding="unicode", xml_declaration=True)
+
+# Print a JUnit result to stdout.
+def print_junit_result(test: Test) -> None:
+ root_element = get_test_suite(test, None)
+ ET.indent(root_element)
+ ET.dump(root_element)
+
+# Write an entire XML file for the test structure starting at test
+def write_junit_result(test: Test, filename: str) -> None:
+ root_element = get_test_suite(test, None)
+ ET.indent(root_element)
+ root_et = ET.ElementTree(root_element)
+ root_et.write(filename, encoding='utf-8', xml_declaration=True)
diff --git a/tools/testing/kunit/kunit_kernel.py b/tools/testing/kunit/kunit_kernel.py
index 2998e1bc088b..58557c47d85f 100644
--- a/tools/testing/kunit/kunit_kernel.py
+++ b/tools/testing/kunit/kunit_kernel.py
@@ -16,7 +16,7 @@ import shutil
import signal
import sys
import threading
-from typing import Iterator, List, Optional, Tuple
+from typing import Iterator, List, Optional, Tuple, Any
from types import FrameType
import kunit_config
@@ -218,7 +218,7 @@ def _get_qemu_ops(config_path: str,
# exists (I learned this through experimentation and could not find it
# anywhere in the Python documentation).
#
- # Bascially, we completely ignore the actual file location of the config
+ # Basically, we completely ignore the actual file location of the config
# we are loading and just tell Python that the module lives in the
# QEMU_CONFIGS_DIR for import purposes regardless of where it actually
# exists as a file.
@@ -265,6 +265,7 @@ class LinuxSourceTree:
if kconfig_add:
kconfig = kunit_config.parse_from_string('\n'.join(kconfig_add))
self._kconfig.merge_in_entries(kconfig)
+ self._process : Optional[subprocess.Popen[Any]] = None
def arch(self) -> str:
return self._arch
@@ -345,6 +346,12 @@ class LinuxSourceTree:
return False
return self.validate_config(build_dir)
+ def _restore_terminal_if_tty(self) -> None:
+ # stty requires a controlling terminal; skip headless runs.
+ if sys.stdin is None or not sys.stdin.isatty():
+ return
+ subprocess.call(['stty', 'sane'])
+
def run_kernel(self, args: Optional[List[str]]=None, build_dir: str='', filter_glob: str='', filter: str='', filter_action: Optional[str]=None, timeout: Optional[int]=None) -> Iterator[str]:
# Copy to avoid mutating the caller-supplied list. exec_tests() reuses
# the same args across repeated run_kernel() calls (e.g. --run_isolated),
@@ -358,36 +365,45 @@ class LinuxSourceTree:
args.append('kunit.filter_action=' + filter_action)
args.append('kunit.enable=1')
- process = self._ops.start(args, build_dir)
- assert process.stdout is not None # tell mypy it's set
+ self._process = self._ops.start(args, build_dir)
+ assert self._process is not None # tell mypy it's set
+ assert self._process.stdout is not None # tell mypy it's set
# Enforce the timeout in a background thread.
def _wait_proc() -> None:
try:
- process.wait(timeout=timeout)
+ if self._process:
+ self._process.wait(timeout=timeout)
except Exception as e:
print(e)
- process.terminate()
- process.wait()
+ if self._process:
+ self._process.terminate()
+ self._process.wait()
waiter = threading.Thread(target=_wait_proc)
waiter.start()
output = open(get_outfile_path(build_dir), 'w')
try:
# Tee the output to the file and to our caller in real time.
- for line in process.stdout:
+ for line in self._process.stdout:
output.write(line)
yield line
# This runs even if our caller doesn't consume every line.
finally:
# Flush any leftover output to the file
- output.write(process.stdout.read())
+ if self._process:
+ if self._process.stdout:
+ output.write(self._process.stdout.read())
+ self._process.stdout.close()
+ self._process = None
output.close()
- process.stdout.close()
waiter.join()
- subprocess.call(['stty', 'sane'])
+ self._restore_terminal_if_tty()
def signal_handler(self, unused_sig: int, unused_frame: Optional[FrameType]) -> None:
logging.error('Build interruption occurred. Cleaning console.')
- subprocess.call(['stty', 'sane'])
+ if self._process:
+ self._process.terminate()
+ self._process.wait()
+ self._restore_terminal_if_tty()
diff --git a/tools/testing/kunit/kunit_parser.py b/tools/testing/kunit/kunit_parser.py
index 5338489dcbe4..d722874bc660 100644
--- a/tools/testing/kunit/kunit_parser.py
+++ b/tools/testing/kunit/kunit_parser.py
@@ -17,7 +17,7 @@ import textwrap
from enum import Enum, auto
from typing import Iterable, Iterator, List, Optional, Tuple
-from kunit_printer import Printer, stdout
+from kunit_printer import Printer
class Test:
"""
@@ -44,11 +44,12 @@ class Test:
self.subtests = [] # type: List[Test]
self.log = [] # type: List[str]
self.counts = TestCounts()
+ self.skip_reason = ''
def __str__(self) -> str:
"""Returns string representation of a Test class object."""
return (f'Test({self.status}, {self.name}, {self.expected_count}, '
- f'{self.subtests}, {self.log}, {self.counts})')
+ f'{self.subtests}, {self.log}, {self.counts}, {self.skip_reason})')
def __repr__(self) -> str:
"""Returns string representation of a Test class object."""
@@ -57,7 +58,7 @@ class Test:
def add_error(self, printer: Printer, error_message: str) -> None:
"""Records an error that occurred while parsing this test."""
self.counts.errors += 1
- printer.print_with_timestamp(stdout.red('[ERROR]') + f' Test: {self.name}: {error_message}')
+ printer.print_with_timestamp(printer.red('[ERROR]') + f' Test: {self.name}: {error_message}')
def ok_status(self) -> bool:
"""Returns true if the status was ok, i.e. passed or skipped."""
@@ -268,7 +269,7 @@ def check_version(version_num: int, accepted_versions: List[int],
if version_num < min(accepted_versions):
test.add_error(printer, f'{version_type} version lower than expected!')
elif version_num > max(accepted_versions):
- test.add_error(printer, f'{version_type} version higer than expected!')
+ test.add_error(printer, f'{version_type} version higher than expected!')
def parse_ktap_header(lines: LineStream, test: Test, printer: Printer) -> bool:
"""
@@ -352,9 +353,9 @@ def parse_test_plan(lines: LineStream, test: Test) -> bool:
lines.pop()
return True
-TEST_RESULT = re.compile(r'^\s*(ok|not ok) ([0-9]+) ?(- )?([^#]*)( # .*)?$')
+TEST_RESULT = re.compile(r'^\s*(ok|not ok) ([0-9]+) ?(:?- )?([^#]*)( # .*)?$')
-TEST_RESULT_SKIP = re.compile(r'^\s*(ok|not ok) ([0-9]+) ?(- )?(.*) # SKIP ?(.*)$')
+TEST_RESULT_SKIP = re.compile(r'^\s*(ok|not ok) ([0-9]+) ?(:?- )?(.*) # SKIP ?(.*)$')
def peek_test_name_match(lines: LineStream, test: Test) -> bool:
"""
@@ -418,7 +419,7 @@ def parse_test_result(lines: LineStream, test: Test,
# Set name of test object
if skip_match:
- test.name = skip_match.group(4) or skip_match.group(5)
+ test.name = skip_match.group(4)
else:
test.name = match.group(4)
@@ -431,6 +432,7 @@ def parse_test_result(lines: LineStream, test: Test,
status = match.group(1)
if skip_match:
test.status = TestStatus.SKIPPED
+ test.skip_reason = skip_match.group(5) or ''
elif status == 'ok':
test.status = TestStatus.SUCCESS
else:
@@ -539,12 +541,15 @@ def format_test_result(test: Test, printer: Printer) -> str:
if test.status == TestStatus.SUCCESS:
return printer.green('[PASSED] ') + test.name
if test.status == TestStatus.SKIPPED:
- return printer.yellow('[SKIPPED] ') + test.name
+ skip_message = printer.yellow('[SKIPPED] ') + test.name
+ if test.skip_reason != '':
+ skip_message += printer.yellow(' (' + test.skip_reason + ')')
+ return skip_message
if test.status == TestStatus.NO_TESTS:
return printer.yellow('[NO TESTS RUN] ') + test.name
if test.status == TestStatus.TEST_CRASHED:
print_log(test.log, printer)
- return stdout.red('[CRASHED] ') + test.name
+ return printer.red('[CRASHED] ') + test.name
print_log(test.log, printer)
return printer.red('[FAILED] ') + test.name
@@ -651,11 +656,11 @@ def print_summary_line(test: Test, printer: Printer) -> None:
printer - Printer object to output results
"""
if test.status == TestStatus.SUCCESS:
- color = stdout.green
+ color = printer.green
elif test.status in (TestStatus.SKIPPED, TestStatus.NO_TESTS):
- color = stdout.yellow
+ color = printer.yellow
else:
- color = stdout.red
+ color = printer.red
printer.print_with_timestamp(color(f'Testing complete. {test.counts}'))
# Summarize failures that might have gone off-screen since we had a lot
@@ -857,7 +862,8 @@ def parse_run_tests(kernel_output: Iterable[str], printer: Printer) -> Test:
test = Test()
if not lines:
test.name = '<missing>'
- test.add_error(printer, 'Could not find any KTAP output. Did any KUnit tests run?')
+ test.add_error(printer, 'Could not find any KTAP output. Did any KUnit tests run?\n' +
+ 'Try running with the --raw_output=all option to see any log messages.')
test.status = TestStatus.FAILURE_TO_PARSE_TESTS
else:
test = parse_test(lines, 0, [], False, printer)
diff --git a/tools/testing/kunit/kunit_tool_test.py b/tools/testing/kunit/kunit_tool_test.py
index f6383884c599..85ae21754bdf 100755
--- a/tools/testing/kunit/kunit_tool_test.py
+++ b/tools/testing/kunit/kunit_tool_test.py
@@ -24,6 +24,7 @@ import kunit_config
import kunit_parser
import kunit_kernel
import kunit_json
+import kunit_junit
import kunit
from kunit_printer import stdout
@@ -235,10 +236,27 @@ class KUnitParserTest(unittest.TestCase):
with open(skipped_log) as file:
result = kunit_parser.parse_run_tests(file.readlines(), stdout)
+ # The test result is skipped, and the skip reason is valid
+ self.assertEqual(kunit_parser.TestStatus.SKIPPED, result.subtests[1].subtests[1].status)
+ self.assertEqual("this test should be skipped", result.subtests[1].subtests[1].skip_reason)
+
# A skipped test does not fail the whole suite.
self.assertEqual(kunit_parser.TestStatus.SUCCESS, result.status)
self.assertEqual(result.counts, kunit_parser.TestCounts(passed=4, skipped=1))
+ def test_skipped_reason_parse(self):
+ skipped_log = _test_data_path('test_skip_all_tests.log')
+ with open(skipped_log) as file:
+ result = kunit_parser.parse_run_tests(file.readlines(), stdout)
+
+ # The first test is skipped, with the correct reaons
+ self.assertEqual(kunit_parser.TestStatus.SKIPPED, result.subtests[0].subtests[0].status)
+ self.assertEqual("all tests skipped", result.subtests[0].subtests[0].skip_reason)
+
+ # The first suite is skipped, with no reason
+ self.assertEqual(kunit_parser.TestStatus.SKIPPED, result.subtests[0].status)
+ self.assertEqual("", result.subtests[0].skip_reason)
+
def test_skipped_all_tests(self):
skipped_log = _test_data_path('test_skip_all_tests.log')
with open(skipped_log) as file:
@@ -529,6 +547,48 @@ class LinuxSourceTreeTest(unittest.TestCase):
self.assertIn('kunit.filter_glob=suite.test1', start_calls[0])
self.assertIn('kunit.filter_glob=suite.test2', start_calls[1])
+ def test_run_kernel_skips_terminal_reset_without_tty(self):
+ def fake_start(unused_args, unused_build_dir):
+ return subprocess.Popen(['printf', 'KTAP version 1\n'],
+ text=True, stdout=subprocess.PIPE)
+
+ non_tty_stdin = mock.Mock()
+ non_tty_stdin.isatty.return_value = False
+
+ with tempfile.TemporaryDirectory('') as build_dir:
+ tree = kunit_kernel.LinuxSourceTree(build_dir, kunitconfig_paths=[os.devnull])
+ with mock.patch.object(tree._ops, 'start', side_effect=fake_start), \
+ mock.patch.object(kunit_kernel.sys, 'stdin', non_tty_stdin), \
+ mock.patch.object(kunit_kernel.subprocess, 'call') as mock_call:
+ for _ in tree.run_kernel(build_dir=build_dir):
+ pass
+
+ mock_call.assert_not_called()
+
+ def test_signal_handler_skips_terminal_reset_without_tty(self):
+ non_tty_stdin = mock.Mock()
+ non_tty_stdin.isatty.return_value = False
+ tree = kunit_kernel.LinuxSourceTree('', kunitconfig_paths=[os.devnull])
+
+ with mock.patch.object(kunit_kernel.sys, 'stdin', non_tty_stdin), \
+ mock.patch.object(kunit_kernel.subprocess, 'call') as mock_call, \
+ mock.patch.object(kunit_kernel.logging, 'error') as mock_error:
+ tree.signal_handler(signal.SIGINT, None)
+ mock_error.assert_called_once()
+ mock_call.assert_not_called()
+
+ def test_signal_handler_resets_terminal_with_tty(self):
+ tty_stdin = mock.Mock()
+ tty_stdin.isatty.return_value = True
+ tree = kunit_kernel.LinuxSourceTree('', kunitconfig_paths=[os.devnull])
+
+ with mock.patch.object(kunit_kernel.sys, 'stdin', tty_stdin), \
+ mock.patch.object(kunit_kernel.subprocess, 'call') as mock_call, \
+ mock.patch.object(kunit_kernel.logging, 'error') as mock_error:
+ tree.signal_handler(signal.SIGINT, None)
+ mock_error.assert_called_once()
+ mock_call.assert_called_once_with(['stty', 'sane'])
+
def test_build_reconfig_no_config(self):
with tempfile.TemporaryDirectory('') as build_dir:
with open(kunit_kernel.get_kunitconfig_path(build_dir), 'w') as f:
@@ -634,6 +694,38 @@ class StrContains(str):
def __eq__(self, other):
return self in other
+class KUnitJUnitTest(unittest.TestCase):
+ def setUp(self):
+ self.print_mock = mock.patch('kunit_printer.Printer.print').start()
+ self.addCleanup(mock.patch.stopall)
+
+ def _junit_string(self, log_file):
+ with open(_test_data_path(log_file)) as file:
+ test_result = kunit_parser.parse_run_tests(file, stdout)
+ junit_string = kunit_junit.get_junit_result(
+ test=test_result)
+ print(junit_string)
+ return junit_string
+
+ def test_failed_test_junit(self):
+ result = self._junit_string('test_is_test_passed-failure.log')
+ self.assertTrue("<failure>" in result)
+
+ def test_skipped_test_junit(self):
+ result = self._junit_string('test_skip_tests.log')
+ self.assertTrue("<skipped>" in result)
+ self.assertTrue("skipped=\"1\"" in result)
+
+ def test_crashed_test_junit(self):
+ result = self._junit_string('test_kernel_panic_interrupt.log')
+ self.assertTrue("<error>" in result);
+
+ def test_no_tests_junit(self):
+ result = self._junit_string('test_is_test_passed-no_tests_run_with_header.log')
+ self.assertTrue("tests=\"0\"" in result)
+ self.assertFalse("testcase" in result)
+
+
class KUnitMainTest(unittest.TestCase):
def setUp(self):
path = _test_data_path('test_is_test_passed-all_passed.log')
@@ -881,12 +973,24 @@ class KUnitMainTest(unittest.TestCase):
self.linux_source_mock.run_kernel.return_value = ['TAP version 14', 'init: random output'] + want
got = kunit._list_tests(self.linux_source_mock,
- kunit.KunitExecRequest(None, None, False, False, '.kunit', 300, 'suite*', '', None, None, 'suite', False, False))
+ kunit.KunitExecRequest(None, None, None, False, False, '.kunit', 300, 'suite*', '', None, None, 'suite', False, False, False))
self.assertEqual(got, want)
# Should respect the user's filter glob when listing tests.
self.linux_source_mock.run_kernel.assert_called_once_with(
args=['kunit.action=list'], build_dir='.kunit', filter_glob='suite*', filter='', filter_action=None, timeout=300)
+ def test_list_tests_with_prefix(self):
+ want = ['suite.test1', 'suite.test2', 'suite2.test1']
+ self.linux_source_mock.run_kernel.return_value = [
+ '[ 0.100000] TAP version 14',
+ '[ 0.200000] suite.test1',
+ '[ 0.200000] suite.test2',
+ '[ 0.300000] suite2.test1']
+
+ got = kunit._list_tests(self.linux_source_mock,
+ kunit.KunitExecRequest(None, None, None, False, False, '.kunit', 300, 'suite*', '', None, None, 'suite', False, False, False))
+ self.assertEqual(got, want)
+
@mock.patch.object(kunit, '_list_tests')
def test_run_isolated_by_suite(self, mock_tests):
mock_tests.return_value = ['suite.test1', 'suite.test2', 'suite2.test1']
@@ -894,7 +998,7 @@ class KUnitMainTest(unittest.TestCase):
# Should respect the user's filter glob when listing tests.
mock_tests.assert_called_once_with(mock.ANY,
- kunit.KunitExecRequest(None, None, False, False, '.kunit', 300, 'suite*.test*', '', None, None, 'suite', False, False))
+ kunit.KunitExecRequest(None, None, None, False, False, '.kunit', 300, 'suite*.test*', '', None, None, 'suite', False, False, False))
self.linux_source_mock.run_kernel.assert_has_calls([
mock.call(args=None, build_dir='.kunit', filter_glob='suite.test*', filter='', filter_action=None, timeout=300),
mock.call(args=None, build_dir='.kunit', filter_glob='suite2.test*', filter='', filter_action=None, timeout=300),
@@ -907,13 +1011,23 @@ class KUnitMainTest(unittest.TestCase):
# Should respect the user's filter glob when listing tests.
mock_tests.assert_called_once_with(mock.ANY,
- kunit.KunitExecRequest(None, None, False, False, '.kunit', 300, 'suite*', '', None, None, 'test', False, False))
+ kunit.KunitExecRequest(None, None, None, False, False, '.kunit', 300, 'suite*', '', None, None, 'test', False, False, False))
self.linux_source_mock.run_kernel.assert_has_calls([
mock.call(args=None, build_dir='.kunit', filter_glob='suite.test1', filter='', filter_action=None, timeout=300),
mock.call(args=None, build_dir='.kunit', filter_glob='suite.test2', filter='', filter_action=None, timeout=300),
mock.call(args=None, build_dir='.kunit', filter_glob='suite2.test1', filter='', filter_action=None, timeout=300),
])
+ @mock.patch.object(kunit, '_list_tests')
+ @mock.patch.object(sys, 'stdout', new_callable=io.StringIO)
+ def test_list_suites(self, mock_stdout, mock_tests):
+ mock_tests.return_value = ['suite.test1', 'suite.test2', 'suite2.test1']
+ kunit.main(['run', '--list_suites'])
+
+ want = ['suite', 'suite2']
+ output = mock_stdout.getvalue().split()
+ self.assertEqual(output, want)
+
@mock.patch.object(sys, 'stdout', new_callable=io.StringIO)
def test_list_cmds(self, mock_stdout):
kunit.main(['--list-cmds'])
diff --git a/tools/testing/kunit/qemu_configs/or1k.py b/tools/testing/kunit/qemu_configs/or1k.py
new file mode 100644
index 000000000000..dfbbad0f9076
--- /dev/null
+++ b/tools/testing/kunit/qemu_configs/or1k.py
@@ -0,0 +1,18 @@
+# SPDX-License-Identifier: GPL-2.0-only
+from ..qemu_config import QemuArchParams
+
+QEMU_ARCH = QemuArchParams(linux_arch='openrisc',
+ kconfig='''
+CONFIG_SERIAL_8250=y
+CONFIG_SERIAL_8250_CONSOLE=y
+CONFIG_SERIAL_OF_PLATFORM=y
+CONFIG_POWER_RESET=y
+CONFIG_POWER_RESET_SYSCON=y
+''',
+ qemu_arch='or1k',
+ kernel_path='vmlinux',
+ kernel_command_line='console=ttyS0',
+ extra_qemu_params=[
+ '-machine', 'virt',
+ '-m', '512',
+ ])